{"text_format":"1","workbook":"xlsx","n_sheets":2,"sheets":["Calculator koeling","Selectietabel"],"not_rendered":{"charts":0,"images":0,"macros":1,"external_links":1,"defined_names":14,"comments":0,"pivot_tables":0},"unopened":[],"bounds":{"document_bytes":16777216,"sheet_cells":100000,"rows_first":2000,"rows_last":500,"rows_between":2000,"halvings":0,"cell_chars":16384,"cell_head_chars":4096},"cells_cut":0,"cells_raw":0,"read":"whole","date_system":"1900"}

{"sheet":"Calculator koeling","index":0,"n_rows":51,"n_cols":33,"rows_kept":51,"cut":false,"hidden":false,"merged":[[37,3,37,8],[0,3,0,10],[38,4,38,7],[43,4,43,7],[42,4,42,7],[41,4,41,7],[40,4,40,7],[39,4,39,7],[50,4,50,7],[49,4,49,7],[48,4,48,7],[47,4,47,7],[46,4,46,7],[45,4,45,7],[44,4,44,7],[30,3,30,7],[1,3,1,10],[5,3,5,8],[7,3,7,8],[8,3,8,8],[9,3,9,8],[10,3,10,8],[23,7,23,8],[25,3,25,7],[31,4,31,7],[32,4,32,7],[33,4,33,7],[34,4,34,7],[35,4,35,7]]}
[{"$f":"IF(AND(A27=\"\",A28=\"\"),A29,IF(A28=\"\",A27,A28))","v":"Bu2,5m2,5"},null,null,"Dit bestand is enkel in beveiligde modus te downloaden. De downloadbare versie van de Vaillant website is een veilig bestand. Kies voor ‘Bestand + opslaan als’ en sluit af. Open het bestand en sta macro´s toe; u kunt veilig werken met de calculator"]
[{"$f":"IFERROR(_xlfn.XLOOKUP(A1,Selectietabel!B:B,Selectietabel!A:A,,0),\"\")","v":"Single-split set 2,5kW"},null,null,"Bij gebruik als bijverwarming is een berekening op basis van koeling toereikend.",null,null,null,null,null,null,null,null,null,null,null,null,null,null,null,null,null,null,null,null,null,null,null,null,null,null,null,null,0]
[{"$f":"HYPERLINK(\"https://2ba.vaillant-tools.nl/media/\"&SUBSTITUTE(A1,\",\",\"\")&\".pdf\")","v":"https://2ba.vaillant-tools.nl/media/Bu25m25.pdf"},null,null,"Bij gebruik als hoofdverwarming is een warmteverliesberekening nodig."]
[]
[null,null,null,"Uitgangspunten:"]
[null,null,null,"watt koelvermogen per kubieke meter (m3) ",null,null,null,null,null,40]
[]
[null,null,null,"Toelichting voor de te kiezen koellast",null,null,null,null,null,"W/m3","Factor"]
[null,null,null,"30 W/m3 bij een goed geïsoleerde ruimte met weinig glas en voorzien van zonwering",null,null,null,null,null,30,0.75]
[null,null,null,"40 W/m3 bij een warmer gelegen ruimte met enkele ramen",null,null,null,null,null,40,1]
[null,null,null,"50 W/m3 bij een warme ruimte met veel glas en weinig tot geen zonwering",null,null,null,null,null,50,1.25]
[]
[]
[null,null,null,"Berekening: Vul blauwe velden"]
[null,null,null,"Koellast:",40]
[null,null,null,"Aantal ruimtes:",1]
[]
[null,null,null,null,"Type","Hoogte (M)","Lengte (M)","Breedte (M)","M3","KW exact","KW binnendeel"]
[{"$f":"IF(K19=\"\",\"\",LEFT('Calculator koeling'!E19,1)&'Calculator koeling'!K19)","v":"M2,5"},null,null,"Ruimte 1","Muur",2.5,5,6,{"$f":"IF(D19=\"\",\"\",(F19*G19*H19))","v":75},{"$f":"IF(D19=\"\",\"\",((I19*$E$15)/1000))","v":3},2.5]
[{"$f":"IF(K20=\"\",\"\",LEFT('Calculator koeling'!E20,1)&'Calculator koeling'!K20)","v":""},null,null,{"$f":"IF(E16>1,\"Ruimte 2\",\"\")","v":""},"Muur",2.5,5,8,{"$f":"IF(D20=\"\",\"\",(F20*G20*H20))","v":""},{"$f":"IF(D20=\"\",\"\",((I20*$E$15)/1000))","v":""}]
[{"$f":"IF(K21=\"\",\"\",LEFT('Calculator koeling'!E21,1)&'Calculator koeling'!K21)","v":""},null,null,{"$f":"IF(E16>2,\"Ruimte 3\",\"\")","v":""},"Muur",2.5,5,6,{"$f":"IF(D21=\"\",\"\",(F21*G21*H21))","v":""},{"$f":"IF(D21=\"\",\"\",((I21*$E$15)/1000))","v":""}]
[{"$f":"IF(K22=\"\",\"\",LEFT('Calculator koeling'!E22,1)&'Calculator koeling'!K22)","v":""},null,null,{"$f":"IF(E16>3,\"Ruimte 4\",\"\")","v":""},"Muur",2.5,4,4,{"$f":"IF(D22=\"\",\"\",(F22*G22*H22))","v":""},""]
[{"$f":"IFERROR(VLOOKUP(A19&A20&A21&A22,Selectietabel!C:C,1,FALSE),\nIFERROR(VLOOKUP(A19&A20&A22&A21,Selectietabel!C:C,1,FALSE),\nIFERROR(VLOOKUP(A19&A21&A20&A22,Selectietabel!C:C,1,FALSE),\nIFERROR(VLOOKUP(A19&A21&A22&A20,Selectietabel!C:C,1,FALSE),\nIFERROR(VLOOKUP(A19&A22&A20&A21,Selectietabel!C:C,1,FALSE),\nIFERROR(VLOOKUP(A19&A22&A21&A20,Selectietabel!C:C,1,FALSE),\nIFERROR(VLOOKUP(A20&A19&A21&A22,Selectietabel!C:C,1,FALSE),\nIFERROR(VLOOKUP(A20&A19&A22&A21,Selectietabel!C:C,1,FALSE),\nIFERROR(VLOOKUP(A20&A21&A22&A19,Selectietabel!C:C,1,FALSE),\nIFERROR(VLOOKUP(A20&A21&A19&A22,Selectietabel!C:C,1,FALSE),\nIFERROR(VLOOKUP(A20&A22&A19&A21,Selectietabel!C:C,1,FALSE),\nIFERROR(VLOOKUP(A20&A22&A21&A19,Selectietabel!C:C,1,FALSE),\nIFERROR(VLOOKUP(A21&A19&A20&A22,Selectietabel!C:C,1,FALSE),\nIFERROR(VLOOKUP(A21&A19&A22&A20,Selectietabel!C:C,1,FALSE),\nIFERROR(VLOOKUP(A21&A20&A19&A22,Selectietabel!C:C,1,FALSE),\nIFERROR(VLOOKUP(A21&A20&A22&A19,Selectietabel!C:C,1,FALSE),\nIFERROR(VLOOKUP(A21&A22&A19&A20,Selectietabel!C:C,1,FALSE),\nIFERROR(VLOOKUP(A21&A22&A20&A19,Selectietabel!C:C,1,FALSE),\nIFERROR(VLOOKUP(A22&A19&A20&A21,Selectietabel!C:C,1,FALSE),\nIFERROR(VLOOKUP(A22&A19&A21&A20,Selectietabel!C:C,1,FALSE),\nIFERROR(VLOOKUP(A22&A20&A19&A21,Selectietabel!C:C,1,FALSE),\nIFERROR(VLOOKUP(A22&A20&A21&A19,Selectietabel!C:C,1,FALSE),\nIFERROR(VLOOKUP(A22&A21&A19&A20,Selectietabel!C:C,1,FALSE),\nIFERROR(VLOOKUP(A22&A21&A20&A19,Selectietabel!C:C,1,FALSE),\n\"\"))))))))))))))))))))))))","v":"m2,5"},null,null,"Totaal",null,null,null,null,null,{"$f":"SUM(J19:J22)","v":3},{"$f":"SUM(K19:K22)","v":2.5}]
[null,null,null,null,null,null,null,"Gelijktijdigheidsfactor",null,{"$f":"IF(E16=1,J23,J23/1.15)","v":3}]
[]
[null,null,null,{"$f":"IF(D28=\"\",\"Buitendeel\",\"Selecteer uw buitendeel  middels het plusje\")","v":"Buitendeel"}]
[{"$f":"(IF(OR(B27=1,D28=\"\"),_xlfn.XLOOKUP(D27,Selectietabel!E:E,Selectietabel!D:D,,0)&A23,\"\"))","v":"Bu2,5m2,5"},1,null,{"$f":"IF(K19=0,\"\",IF(A23=\"\",\"Geen standaard combinatie\",_xlfn._xlws.FILTER(Selectietabel!E:E,Selectietabel!C:C=A23,\"\")))","v":"0010022645"},{"$f":"IF(D27=\"Geen standaard combinatie\",\"Overweeg meerdere buitenunits, of contacteer Vaillant\",IFERROR(VLOOKUP(D27,Selectietabel!V:W,2,FALSE),\"\"))","v":"climaVAIR mono 2,5kW buitenunit ¼-⅜ VAI5-025WNO"}]
[{"$f":"(IF(D28=\"\",\"\",IF(B28=1,_xlfn.XLOOKUP(D28,Selectietabel!E:E,Selectietabel!D:D,,0)&A23,\"\")))","v":""},0,null,null,{"$f":"IF(D27=\"Geen standaard combinatie\",\"\",IFERROR(VLOOKUP(D28,Selectietabel!V:W,2,FALSE),\"\"))","v":""}]
[{"$f":"(IF(D29=\"\",\"\",IF(B29=1,_xlfn.XLOOKUP(D29,Selectietabel!E:E,Selectietabel!D:D,,0)&A23,\"\")))","v":""},0,null,null,{"$f":"IF(D27=\"Geen selectie mogelijk\",\"\",IFERROR(VLOOKUP(D29,Selectietabel!V:W,2,FALSE),\"\"))","v":""}]
[]
[null,null,null,"Binnendeel"]
[null,null,null,{"$f":"IF(OR($D$27=\"Geen standaard combinatie\",$D$27=\"\"),\"\",IF($A$1=\"\",\"\",IF(_xlfn.XLOOKUP($A$1,Selectietabel!B:B,Selectietabel!F:F,,0)=0,\"\",_xlfn.XLOOKUP($A$1,Selectietabel!B:B,Selectietabel!F:F,,0))))","v":"0010022692"},{"$f":"IF(D32=\"\",\"\",VLOOKUP(D32,Selectietabel!V:W,2,FALSE))","v":"climaVAIR 2,5kW binnenunit ¼-⅜ VAI5-025WNI"}]
[null,null,null,{"$f":"IF(OR($D$27=\"Geen standaard combinatie\",$D$27=\"\"),\"\",IF($A$1=\"\",\"\",IF(_xlfn.XLOOKUP($A$1,Selectietabel!B:B,Selectietabel!G:G,,0)=0,\"\",_xlfn.XLOOKUP($A$1,Selectietabel!B:B,Selectietabel!G:G,,0))))","v":""},{"$f":"IF(D33=\"\",\"\",VLOOKUP(D33,Selectietabel!V:W,2,FALSE))","v":""}]
[null,null,null,{"$f":"IF(OR($D$27=\"Geen standaard combinatie\",$D$27=\"\"),\"\",IF($A$1=\"\",\"\",IF(_xlfn.XLOOKUP($A$1,Selectietabel!B:B,Selectietabel!H:H,,0)=0,\"\",_xlfn.XLOOKUP($A$1,Selectietabel!B:B,Selectietabel!H:H,,0))))","v":""},{"$f":"IF(D34=\"\",\"\",VLOOKUP(D34,Selectietabel!V:W,2,FALSE))","v":""}]
[null,null,null,{"$f":"IF(OR($D$27=\"Geen standaard combinatie\",$D$27=\"\"),\"\",IF($A$1=\"\",\"\",IF(_xlfn.XLOOKUP($A$1,Selectietabel!B:B,Selectietabel!I:I,,0)=0,\"\",_xlfn.XLOOKUP($A$1,Selectietabel!B:B,Selectietabel!I:I,,0))))","v":""},{"$f":"IF(D35=\"\",\"\",VLOOKUP(D35,Selectietabel!V:W,2,FALSE))","v":""}]
[null,null,null,{"$f":"IF(COUNTIF(D32:D35,\"0010022705\")>0,\"0020251955\",\"\")","v":""},{"$f":"IF(D36=\"\",\"\",\"climaVAIR 3,5kW casette plaat VAI8/5-035 PKMNI\")","v":""},null,null,null,{"$f":"IF((COUNTIF(D32:D35,\"0010022705\"))=0,\"\",(COUNTIF(D32:D35,\"0010022705\")))","v":""}]
[]
[null,null,null,{"$f":"IF(D27=\"Geen selectie mogelijk\",\"\",IF(A1=\"\",\"\",\"Accessoires \"&A2))","v":"Accessoires Single-split set 2,5kW"}]
[null,null,null,"Artikelnummer","Omschrijving",null,null,null,"Aantal"]
[null,null,null,{"$f":"IF(OR($D$27=\"Geen standaard combinatie\",$D$27=\"\"),\"\",IF($A$1=\"\",\"\",IF(VLOOKUP($A$1,Selectietabel!B:AX,9,FALSE)=\"\",\"\",IFERROR(VLOOKUP($A$1,Selectietabel!B:AX,9,FALSE),\"\"))))","v":"0010039939"},{"$f":"IF(D40=\"\",\"\",VLOOKUP(D40,Selectietabel!V:X,2,FALSE))","v":"climaVAIR wifi module VAI8/5-i tbv muurmodellen"}]
{"$rows_left_out":12}
{"sheet":"Selectietabel","index":1,"n_rows":98,"n_cols":23,"rows_kept":98,"cut":false,"hidden":true,"merged":[]}
["Systeem: Systemen","Set code","Binnen Code","Buiten Code","Buitenunit","Bi1 art nr","Bi2 art nr","Bi3 art nr","Bi4 art nr","Acc 1","Acc 2","Acc 3","Acc 4","Acc 5","Acc 6","Acc 7","Acc 8","Acc 9","Acc 10","Acc 11","Acc 12","Artikel","Artikelnummer"]
["Multi-split 4 kW, Muur 2kW, Muur 2kW","Bu4m2m2","m2m2",{"$f":"LEFT(B2,3)","v":"Bu4"},"0010022668","0010022691","0010022691",null,null,"0010039939","0020250224","0020250225","0020250226","0020252091","0020257890","0010030970","0010030971","0020250311","0020250309",null,null,"0010022645","climaVAIR mono 2,5kW buitenunit ¼-⅜ VAI5-025WNO"]
["Multi-split 4 kW, Muur 2kW, Muur 2,5kW","Bu4m2m2,5","m2m2,5",{"$f":"LEFT(B3,3)","v":"Bu4"},"0010022668","0010022691","0010022692",null,null,"0010039939","0020250224","0020250225","0020250226","0020252091","0020257890","0010030970","0010030971","0020250311","0020250309",null,null,"0010022646","climaVAIR mono 3,5kW buitenunit ¼-⅜ VAI5-035WNO"]
["Multi-split 5 kW, Muur 2kW, Muur 2kW","Bu5m2m2","m2m2","Bu5","0010022669","0010022691","0010022691",null,null,"0010039939","0020250224","0020250225","0020250226","0020252091","0020257890","0010030970","0010030971","0020250311","0020250309",null,null,"0010022647","climaVAIR mono 5,0kW buitenunit ¼-½ VAI5-050WNO"]
["Multi-split 5 kW, Muur 2kW, Muur 2,5kW","Bu5m2m2,5","m2m2,5","Bu5","0010022669","0010022691","0010022692",null,null,"0010039939","0020250224","0020250225","0020250226","0020252091","0020257890","0010030970","0010030971","0020250311","0020250309",null,null,"0010022648","climaVAIR mono 6,5kW buitenunit ¼-⅝ VAI5-065WNO"]
["Multi-split 5 kW, Muur 2kW, Muur 3,5kW","Bu5m2m3,5","m2m3,5","Bu5","0010022669","0010022691","0010022693",null,null,"0010039939","0020250224","0020250225","0020250226","0020252091","0020257890","0010030970","0010030971","0020250311","0020250309",null,null,"0010022691","climaVAIR 2,0kW binnenunit ¼-⅜ VAI5-020WNI"]
["Multi-split 5 kW, Muur 2kW, Plafond 3,5kW","Bu5m2p3,5","m2p3,5","Bu5","0010022669","0010022691","0010022705",null,null,"0010039939","0020250224","0020250225","0020250226","0020252091","0020257890","0010030970","0010030971","0020250311","0020250309",null,null,"0010022692","climaVAIR 2,5kW binnenunit ¼-⅜ VAI5-025WNI"]
["Multi-split 5 kW, Muur 2kW, Vloer 3,5kW","Bu5m2v3,5","m2v3,5","Bu5","0010022669","0010022691","0010022706",null,null,"0010039939","0020250224","0020250225","0020250226","0020252091","0020257890","0010030970","0010030971","0010030972","0020250311","0020250309","0020250312","0010022693","climaVAIR 3,5kW binnenunit ¼-⅜ VAI5-035WNI"]
["Multi-split 5 kW, Muur 2,5kW, Muur 2,5kW","Bu5m2,5m2,5","m2,5m2,5","Bu5","0010022669","0010022692","0010022692",null,null,"0010039939","0020250224","0020250225","0020250226","0020252091","0020257890","0010030970","0010030971","0020250311","0020250309",null,null,"0010022694","climaVAIR 5,0kW binnenunit ¼-½ VAI5-050WNI"]
["Multi-split 5 kW, Muur 2,5kW, Muur 3,5kW","Bu5m2,5m3,5","m2,5m3,5","Bu5","0010022669","0010022692","0010022693",null,null,"0010039939","0020250224","0020250225","0020250226","0020252091","0020257890","0010030970","0010030971","0020250311","0020250309",null,null,"0010022695","climaVAIR 6,5kW binnenunit ¼-⅝ VAI5-065WNI"]
["Multi-split 5 kW, Muur 2,5kW, Plafond 3,5kW","Bu5m2,5p3,5","m2,5p3,5","Bu5","0010022669","0010022692","0010022705",null,null,"0010039939","0020250224","0020250225","0020250226","0020252091","0020257890","0010030970","0010030971","0020250311","0020250309",null,null,"0010022668","climaVAIR multi 4,0kW buitenunit ¼-⅜ VAF5-040W2NO"]
["Multi-split 5 kW, Muur 2,5kW, Vloer 3,5kW","Bu5m2,5v3,5","m2,5v3,5","Bu5","0010022669","0010022692","0010022706",null,null,"0010039939","0020250224","0020250225","0020250226","0020252091","0020257890","0010030970","0010030971","0010030972","0020250311","0020250309","0020250312","0010022669","climaVAIR multi 5,0kW buitenunit ¼-⅜ VAF5-050W2NO"]
["Multi-split 7 kW, Muur 2kW, Muur 3,5kW","Bu7m2m3,5","m2m3,5","Bu7","0010022670","0010022691","0010022693",null,null,"0010039939","0020250224","0020250225","0020250226","0020252091","0020257890","0010030970","0010030971","0020250311","0020250309",null,null,"0010022670","climaVAIR multi 7,0kW buitenunit ¼-⅜ VAF5-070W3NO"]
["Multi-split 7 kW, Muur 2kW, Plafond 3,5kW","Bu7m2p3,5","m2p3,5","Bu7","0010022670","0010022691","0010022705",null,null,"0010039939","0020250224","0020250225","0020250226","0020252091","0020257890","0010030970","0010030971","0020250311","0020250309",null,null,"0010022671","climaVAIR multi 8,0kW buitenunit ¼-⅜ VAF5-080W4NO"]
["Multi-split 7 kW, Muur 2kW, Vloer 3,5kW","Bu7m2v3,5","m2v3,5","Bu7","0010022670","0010022691","0010022706",null,null,"0010039939","0020250224","0020250225","0020250226","0020252091","0020257890","0010030970","0010030971","0010030972","0020250311","0020250309","0020250312","0010022705","climaVAIR 3,5kW plafond casette binnenunit ¼-⅜ VAI8/5-035 KMNI"]
["Multi-split 7 kW, Muur 2kW, Muur 5kW","Bu7m2m5","m2m5","Bu7","0010022670","0010022691","0010022694",null,null,"0010039939","0020250224","0020250225","0020250226","0020252091","0020257890","0010030970","0010030971","0010030972","0020250311","0020250309","0020250312","0010022706","climaVAIR 3,5kW vloer/wand binnenunit ¼-½ VAI8/5-035 FMNI"]
["Multi-split 7 kW, Muur 2,5kW, Muur 2,5kW","Bu7m2,5m2,5","m2,5m2,5","Bu7","0010022670","0010022692","0010022692",null,null,"0010039939","0020250224","0020250225","0020250226","0020252091","0020257890","0010030970","0010030971","0020250311","0020250309",null,null,"0020251955","climaVAIR 3,5kW casette plaat VAI8/5-035 PKMNI"]
["Multi-split 7 kW, Muur 2,5kW, Muur 3,5kW","Bu7m2,5m3,5","m2,5m3,5","Bu7","0010022670","0010022692","0010022693",null,null,"0010039939","0020250224","0020250225","0020250226","0020252091","0020257890","0010030970","0010030971","0020250311","0020250309",null,null,"0010030970","SAE Connector, 1/4'"]
["Multi-split 7 kW, Muur 2,5kW, Plafond 3,5kW","Bu7m2,5p3,5","m2,5p3,5","Bu7","0010022670","0010022692","0010022705",null,null,"0010039939","0020250224","0020250225","0020250226","0020252091","0020257890","0010030970","0010030971","0020250311","0020250309",null,null,"0010030971","SAE Connector, 3/8'"]
["Multi-split 7 kW, Muur 2,5kW, Vloer 3,5kW","Bu7m2,5v3,5","m2,5v3,5","Bu7","0010022670","0010022692","0010022706",null,null,"0010039939","0020250224","0020250225","0020250226","0020252091","0020257890","0010030970","0010030971","0010030972","0020250311","0020250309","0020250312","0010030972","SAE Connector, 1/2'"]
["Multi-split 7 kW, Muur 2,5kW, Muur 5kW","Bu7m2,5m5","m2,5m5","Bu7","0010022670","0010022692","0010022694",null,null,"0010039939","0020250224","0020250225","0020250226","0020252091","0020257890","0010030970","0010030971","0010030972","0020250311","0020250309","0020250312","0010030973","SAE Connector, 5/8'"]
["Multi-split 7 kW, Muur 3,5kW, Muur 3,5kW","Bu7m3,5m3,5","m3,5m3,5","Bu7","0010022670","0010022693","0010022693",null,null,"0010039939","0020250224","0020250225","0020250226","0020252091","0020257890","0010030970","0010030971","0020250311","0020250309",null,null,"0020250311","Enkel geïsol koudemiddelleiding,25m 1/4'"]
["Multi-split 7 kW, Muur 3,5kW, Plafond 3,5kW","Bu7m3,5p3,5","m3,5p3,5","Bu7","0010022670","0010022693","0010022705",null,null,"0010039939","0020250224","0020250225","0020250226","0020252091","0020257890","0010030970","0010030971","0020250311","0020250309",null,null,"0020250309","Enkel geïsol koudemiddelleiding,25m 3/8'"]
["Multi-split 7 kW, Muur 3,5kW, Vloer 3,5kW","Bu7m3,5v3,5","m3,5v3,5","Bu7","0010022670","0010022693","0010022706",null,null,"0010039939","0020250224","0020250225","0020250226","0020252091","0020257890","0010030970","0010030971","0010030972","0020250311","0020250309","0020250312","0020250312","Enkel geïsol koudemiddelleiding,25m 1/2'"]
["Multi-split 7 kW, Plafond 3,5kW, Plafond 3,5kW","Bu7p3,5p3,5","p3,5p3,5","Bu7","0010022670","0010022705","0010022705",null,null,"0020250224","0020250225","0020250226","0020252091","0020257890","0010030970","0010030971","0020250311","0020250309",null,null,null,"0020250310","Enkel geïsol koudemiddelleiding,25m 5/8'"]
["Multi-split 7 kW, Plafond 3,5kW, Vloer 3,5kW","Bu7p3,5v3,5","p3,5v3,5","Bu7","0010022670","0010022705","0010022706",null,null,"0020250224","0020250225","0020250226","0020252091","0020257890","0010030970","0010030971","0010030972","0020250311","0020250309","0020250312",null,"0010039939","climaVAIR wifi module VAI8/5-i tbv muurmodellen"]
["Multi-split 7 kW, Vloer 3,5kW, Vloer 3,5kW","Bu7v3,5v3,5","v3,5v3,5","Bu7","0010022670","0010022706","0010022706",null,null,"0020250224","0020250225","0020250226","0020252091","0020257890","0010030970","0010030971","0010030972","0020250311","0020250309","0020250312",null,"0020250224","Wandsokkel voor geïsoleerde wanden"]
["Multi-split 7 kW, Muur 3,5kW, Muur 5kW","Bu7m3,5m5","m3,5m5","Bu7","0010022670","0010022693","0010022694",null,null,"0010039939","0020250224","0020250225","0020250226","0020252091","0020257890","0010030970","0010030971","0010030972","0020250311","0020250309","0020250312","0020250225","Wandsokkel voor ongeïsoleerde wanden"]
["Multi-split 7 kW, Plafond 3,5kW, Muur 5kW","Bu7p3,5m5","p3,5m5","Bu7","0010022670","0010022705","0010022694",null,null,"0010039939","0020250224","0020250225","0020250226","0020252091","0020257890","0010030970","0010030971","0010030972","0020250311","0020250309","0020250312","0020250226","Grote trillingsdempers, set a 2 st."]
["Multi-split 7 kW, Vloer 3,5kW, Muur 5kW","Bu7v3,5m5","v3,5m5","Bu7","0010022670","0010022706","0010022694",null,null,"0010039939","0020250224","0020250225","0020250226","0020252091","0020257890","0010030970","0010030972","0020250311","0020250312",null,null,"0020252091","Kleine trillingsdempers, set a 4 st."]
["Multi-split 7 kW, Muur 2kW, Muur 2kW, Muur 2kW","Bu7m2m2m2","m2m2m2","Bu7","0010022670","0010022691","0010022691","0010022691",null,"0010039939","0020250224","0020250225","0020250226","0020252091","0020257890","0010030970","0010030971","0020250311","0020250309",null,null,"0020257890","climVAIR aan/uit contact VAI8/5-S4"]
["Multi-split 7 kW, Muur 2kW, Muur 2kW, Muur 2,5kW","Bu7m2m2m2,5","m2m2m2,5","Bu7","0010022670","0010022691","0010022691","0010022692",null,"0010039939","0020250224","0020250225","0020250226","0020252091","0020257890","0010030970","0010030971","0020250311","0020250309"]
["Multi-split 7 kW, Muur 2kW, Muur 2kW, Muur 3,5kW","Bu7m2m2m3,5","m2m2m3,5","Bu7","0010022670","0010022691","0010022691","0010022693",null,"0010039939","0020250224","0020250225","0020250226","0020252091","0020257890","0010030970","0010030971","0020250311","0020250309"]
["Multi-split 7 kW, Muur 2kW, Muur 2kW, Plafond 3,5kW","Bu7m2m2p3,5","m2m2p3,5","Bu7","0010022670","0010022691","0010022691","0010022705",null,"0010039939","0020250224","0020250225","0020250226","0020252091","0020257890","0010030970","0010030971","0020250311","0020250309"]
["Multi-split 7 kW, Muur 2kW, Muur 2kW, Vloer 3,5kW","Bu7m2m2v3,5","m2m2v3,5","Bu7","0010022670","0010022691","0010022691","0010022706",null,"0010039939","0020250224","0020250225","0020250226","0020252091","0020257890","0010030970","0010030971","0010030972","0020250311","0020250309","0020250312"]
["Multi-split 7 kW, Muur 2kW, Muur 2,5kW, Muur 2,5kW","Bu7m2m2,5m2,5","m2m2,5m2,5","Bu7","0010022670","0010022691","0010022692","0010022692",null,"0010039939","0020250224","0020250225","0020250226","0020252091","0020257890","0010030970","0010030971","0020250311","0020250309"]
["Multi-split 7 kW, Muur 2kW, Muur 2,5kW, Muur 3,5kW","Bu7m2m2,5m3,5","m2m2,5m3,5","Bu7","0010022670","0010022691","0010022692","0010022693",null,"0010039939","0020250224","0020250225","0020250226","0020252091","0020257890","0010030970","0010030971","0020250311","0020250309"]
["Multi-split 7 kW, Muur 2kW, Muur 2,5kW, Plafond 3,5kW","Bu7m2m2,5p3,5","m2m2,5p3,5","Bu7","0010022670","0010022691","0010022692","0010022705",null,"0010039939","0020250224","0020250225","0020250226","0020252091","0020257890","0010030970","0010030971","0020250311","0020250309"]
["Multi-split 7 kW, Muur 2kW, Muur 2,5kW, Vloer 3,5kW","Bu7m2m2,5v3,5","m2m2,5v3,5","Bu7","0010022670","0010022691","0010022692","0010022706",null,"0010039939","0020250224","0020250225","0020250226","0020252091","0020257890","0010030970","0010030971","0010030972","0020250311","0020250309","0020250312"]
["Multi-split 7 kW, Muur 2,5kW, Muur 2,5kW, Muur 2,5kW","Bu7m2,5m2,5m2,5","m2,5m2,5m2,5","Bu7","0010022670","0010022692","0010022692","0010022692",null,"0010039939","0020250224","0020250225","0020250226","0020252091","0020257890","0010030970","0010030971","0020250311","0020250309"]
{"$rows_left_out":58}